{"text_format":"3","workbook":"xlsx","n_sheets":10,"sheets":["Instructions","General Calculators","Paycheck Calc","Work Number","calculations","Self-Employment","Missing Check","Missing Check Old","Pay Rate Conversion","Day Care"],"not_rendered":{"macros":1,"external_links":1,"defined_names":9},"read":"whole","date_system":"1900"}

{"sheet":"Instructions","index":0,"n_rows":46,"n_cols":2,"rows_kept":46}
[null,"Original calculator created by David Imeson for D2 and was last revised 12/2012.  It was then reconstructed by D16's Washington County Processing Center Lead Workers (Claudia Monterroso, Kane Ransom, and Tristan Brunscheon) in 11/2013, latest version is version 1.98 (06/11/2019)"]
[]
[null,"**If you find any issues with the Calculators, or have any suggestions on items to improve or add please e-mail Tristan.J.Brunscheon@state.or.us so we can include your suggestions in the next update.**"]
[]
[null,"District 16 Income Calculator Instructions"]
[null,"General guidelines for all calculators:\nOnly enter information into grey cells. It is fine to delete or write over information in the grey cells.\nCopy from the white cells that are surrounded by bright blue (the perimeter of these cells turn green when selected). Never delete or cut information from these cells, they should only ever be copied.\nHold down the left mouse button and drag over the cells that you want to copy, then either do ctrl+C or right click and select copy to copy that information.\nTo clear information in grey cells, select the cells and hit delete on you keyboard or right click and select clear contents.\nIf cells get corrupted, you can hit ctrl+Z repeatedly until the cells are uncorrupted, if this does not fix the problem, close the spreadsheet and reopen it.\nNever save the document, only close it without saving it, that way no cells will get corrupted on the original document. \nUse the tabs at the bottom of the spreadsheet to move between the various sheets (ie \"general calculators\", \"paycheck calc,\" \"work number,\" etc."]
[]
[null,"Date Plus and age calculations: \nThe far left field just functions like date plus but also makes it so you can enter a Participants DOB and find out their age. The lowest row in this section allows you to select plus or minus and you can enter how many days it will add or subtract from the date that you enter."]
[]
[null,"Instructions for the based on hours and rate of pay field:\nSelect whether you will be basing income on weekly or daily pay, then enter the information in the fields that appear."]
[]
[]
[]
[null,"UC and TIPS, enter the amount, copy where it says copy in the green box."]
[]
{"$rows_left_out":26}
{"sheet":"General Calculators","index":1,"n_rows":113,"n_cols":20,"rows_kept":113,"merged":[[1,1,1,3],[1,5,1,7],[1,10,1,12],[9,5,13,7],[9,10,13,12],[14,1,14,3],[16,5,16,7],[16,10,16,12],[20,1,30,1],[20,3,30,3],[25,5,30,7],[25,10,30,12]]}
[]
[null,"Date Plus and Participant Age",{"$nulls":3},"Mortgage Calculator",{"$nulls":4},"Child Support"]
[null,"Today's Date:",{"$f":"TODAY()","v":"2020-06-09"},"AGE:",{"$nulls":7}," "]
[null,"DOB:","2001-06-01",{"$f":"(C3-C4)/365","v":{"v":19.035616438356165,"d":"19.04"}},null,"Monthly Mortgage:",{"$nulls":4},"Getting/Paying:","unselected"]
[null,"Date:","2019-06-01",null,null,"Monthly HOA:",{"$nulls":3}," ","Frequency:","unselected"]
[null," ","10 Days",{"$f":"10+C$5","v":"2019-06-11"},null,"Monthly Space Rent:",{"$nulls":4},"Amount:"]
[null,null,"15 Days",{"$f":"15+C$5","v":"2019-06-16"},null,"Annual Home Insurance:",{"$nulls":4},"Verified:","unselected"]
[null,null,"30 Days",{"$f":"30+C$5","v":"2019-07-01"},null,"Annual Property Tax:",{"$nulls":5}," "," "," "]
[null,null,"45 Days",{"$f":"45+C$5","v":"2019-07-16"}]
[null,null,"60 Days",{"$f":"60+C$5","v":"2019-07-31"},null,{"$f":"IF(G6+G4+G5+G7+G8>0,S103,\"\")","v":""},{"$nulls":4},{"$f":"IF(L6>0,D70,\"\")","v":""}]
[null,null,"90 Days",{"$f":"90+C$5","v":"2019-08-30"}]
[null,null,"minus 60 Days",{"$f":"C5-60","v":"2019-04-02"}]
[null,null,"minus 120 Days",{"$f":"C5-120","v":"2019-02-01"}]
[]
[null,"Below, select plus or minus and enter # of days.",{"$nulls":3},{"$f":"IF(OR(F10<>\"\"),\"copy here>>>\",\"\")","v":""},{"$f":"F10","v":""}," ",null,null,{"$f":"IF(OR(K10<>\"\"),\"copy here>>>\",\"\")","v":""},{"$f":"K10","v":""}," "]
{"$rows_left_out":79}
{"sheet":"Paycheck Calc","index":2,"n_rows":95,"n_cols":16,"rows_kept":95,"merged":[[1,1,1,9],[3,8,4,8],[5,1,5,4],[9,1,9,2],[31,3,31,4],[32,3,32,4],[33,3,33,4],[34,3,34,4],[35,3,35,4]]}
[]
[null,"Paycheck Calculator"]
[]
[{"$nulls":4},"Frequency of Pay:","unselected",null,null,{"$f":"IF(F30>0,I39,\"\")","v":""}]
[{"$nulls":7}," "]
[null,{"$f":"IF(OR(F4=H51),\"Converted Income:\",IF(OR(F4=H52),\"Converted Income:\",IF(OR(F4=H53),\"Converted Income:\",IF(OR(F4=H54),\"Average Monthly Income:\",\"<<Select Frequency of Pay Above>>\"))))","v":"<<Select Frequency of Pay Above>>"},{"$nulls":3},{"$f":"IF(ISERROR(G8),\"\",(G8))","v":""}]
[{"$nulls":4},"Participant Name:"]
[{"$nulls":4},"Employer Name:",null,{"$f":"IF(OR(F4=H51),F42,IF(OR(F4=H52),F43,IF(OR(F4=H53),F44,IF(OR(F4=H54),F45,\"\"))))","v":""},{"$nulls":5},"Excluded"]
[{"$nulls":4},"Hourly Pay Rate:",null,{"$f":"IF(OR(F4=H51),G42,IF(OR(F4=H52),G43,IF(OR(F4=H53),G44,IF(OR(F4=H54),G45,\"\"))))","v":""},{"$f":"IF(F11<>\"\",\"copy here >>\",\"\")","v":""},{"$f":"I4","v":""}," ",null,{"$f":"IF(ISERROR(F30/F32),\"\",(F30/F32))","v":""}]
[null,"Days Between Checks:",null,"DATE:","HOURS:","INCOME:",{"$f":"IF(OR(F4=H51),H42,IF(OR(F4=H52),H43,IF(OR(F4=H53),H44,IF(OR(F4=H54),H45,\"\"))))","v":""},{"$f":"IF(F11<>\"\",\"copy here >>\",\"\")","v":""},{"$nulls":5},"checks","excluded","remaining"]
[{"$nulls":7},{"$f":"IF(F11<>\"\",\"copy here >>\",\"\")","v":""},{"$f":"IF(F11<>\"\",I77&(IF(E11<>\"\",\"  -  \"&E11&\" hrs\",\"\")),\"\")&IF(calculations!K10=TRUE,\",  Excluded as <<insert reason here>>\",\"\")","v":""},null,null,{"$f":"IF(calculations!$K10=FALSE,E11,0)","v":0},{"$f":"IF(calculations!$K10=FALSE,F11,0)","v":0},{"$f":"19-COUNTBLANK(F11:F29)","v":0},{"$f":"COUNTIF(calculations!K10:K28,TRUE)","v":0},{"$f":"N11-O11+O13","v":0}]
[null,{"$f":"IF(OR(A49=FALSE),\"\",A49)","v":""},{"$nulls":5},{"$f":"IF(F11<>\"\",\"copy here >>\",\"\")","v":""},{"$f":"IF(F12<>\"\",I78&(IF(E12<>\"\",\"  -  \"&E12&\" hrs\",\"\")),IF(F11<>\"\",\"Coded Income: \"&TEXT($F$6,\"####.00\")&IF($F$35<>\"n/a\",\" - *JPI/Stu* Hrs/wk: \"&TEXT($F$35,\"####.00\"),\"\"),\"\"))&IF(calculations!K11=TRUE,\",  Excluded as <<insert reason here>>\",\"\")","v":""},null,null,{"$f":"IF(calculations!$K11=FALSE,E12,0)","v":0},{"$f":"IF(calculations!$K11=FALSE,F12,0)","v":0}]
[null,{"$f":"IF(OR(A50=FALSE),\"\",A50)","v":""},{"$nulls":5},"",{"$f":"IF(F13<>\"\",I79&(IF(E13<>\"\",\"  -  \"&E13&\" hrs\",\"\")),IF(F12<>\"\",\"Coded Income: \"&TEXT($F$6,\"####.00\")&IF($F$35<>\"n/a\",\" - *JPI/Stu* Hrs/wk: \"&TEXT($F$35,\"####.00\"),\"\"),\"\"))&IF(calculations!K12=TRUE,\",  Excluded as <<insert reason here>>\",\"\")","v":""},null,null,{"$f":"IF(calculations!$K12=FALSE,E13,0)","v":0},{"$f":"IF(calculations!$K12=FALSE,F13,0)","v":0},null,{"$f":"(SUMPRODUCT(--(ISNUMBER(SEARCH(\"true\",calculations!K10:K28))),--(F11:F29=\"\")))","v":0}]
[null,{"$f":"IF(OR(A51=FALSE),\"\",A51)","v":""},{"$nulls":5},"",{"$f":"IF(F14<>\"\",I80&(IF(E14<>\"\",\"  -  \"&E14&\" hrs\",\"\")),IF(F13<>\"\",\"Coded Income: \"&TEXT($F$6,\"####.00\")&IF($F$35<>\"n/a\",\" - *JPI/Stu* Hrs/wk: \"&TEXT($F$35,\"####.00\"),\"\"),\"\"))&IF(calculations!K13=TRUE,\",  Excluded as <<insert reason here>>\",\"\")","v":""},null,null,{"$f":"IF(calculations!$K13=FALSE,E14,0)","v":0},{"$f":"IF(calculations!$K13=FALSE,F14,0)","v":0}]
[null,"",{"$nulls":5},"",{"$f":"IF(F15<>\"\",I81&(IF(E15<>\"\",\"  -  \"&E15&\" hrs\",\"\")),IF(F14<>\"\",\"Coded Income: \"&TEXT($F$6,\"####.00\")&IF($F$35<>\"n/a\",\" - *JPI/Stu* Hrs/wk: \"&TEXT($F$35,\"####.00\"),\"\"),\"\"))&IF(calculations!K14=TRUE,\",  Excluded as <<insert reason here>>\",\"\")","v":""},null,null,{"$f":"IF(calculations!$K14=FALSE,E15,0)","v":0},{"$f":"IF(calculations!$K14=FALSE,F15,0)","v":0}]
{"$rows_left_out":81}
{"sheet":"Work Number","index":3,"n_rows":249,"n_cols":41,"rows_kept":249,"merged":[[1,1,1,19],[1,29,4,29],[3,18,10,18],[7,10,7,12],[8,11,8,12],[9,11,9,12],[11,23,13,23],[15,8,15,9],[38,11,38,12],[39,11,39,12],[40,11,40,12],[41,11,41,12],[269,23,271,23]]}
[{"$nulls":20},16,{"$nulls":8},6,12,12,12,12,12,10,4,12,56,16]
[null,"Work Number Calculator",{"$nulls":27},{"$f":"IF(OR(J14=\"\",N4=\"unselected\"),\"\",\"The following information is from Work#'s 'Income Summary' for \"&J14&\" and is current as of \"&TEXT(TODAY(),(\"mm/dd/yyyy\"))&\":  Base Salary: $\"&K14&\", Overtime: $\"&L14&\", Commissions: $\"&M14&\", Bonus: $\"&N14&\", Other: $\"&O14&\", Total: $\"&P14&\".\")","v":""}]
[{"$nulls":3},"Paste Income Summery Info Below (Yellow):",null,null,"Paste Paydate Info Below (Yellow):",{"$nulls":16},"Paste Income Summery Info Below (Yellow):"]
[null,null,"Year:",{"$f":"IF(X4=\"\",\"\",X4)","v":""},null,"(1) Period End Date:",{"$f":"IF(X15=\"\",\"\",X15)","v":""},{"$nulls":5},"Frequency of Pay:  ","Unselected",{"$nulls":4},{"$f":"IF(N36=0,\"\",AD46&\"\n\n \"&AD2)","v":""}," ",null,null,"Year:"]
[null,null,"Base Salary:",{"$f":"IF(X5=\"\",\"\",X5)","v":""},null,"(1) Pay Date:","",{"$nulls":12}," ",null,null,"Base Salary:"]
[null,null,"Overtime:","",null,"(1) Hours Worked:","",{"$nulls":7},{"$f":"IF(OR(N4=AB55),AD63,IF(OR(N4=AB56),AD64,IF(OR(N4=AB57),AD65,IF(OR(N4=AB58),AD66,0))))","v":0},{"$nulls":4}," ",null,null,"Overtime:"]
[null,null,"Commissions:","",null,"(1) Gross Earnings:","",{"$nulls":7},{"$f":"IF(OR(N4=AB55),AE63,IF(OR(N4=AB56),AE64,IF(OR(N4=AB57),AE65,IF(OR(N4=AB58),AE66,0))))","v":0},{"$nulls":4}," ",null,null,"Commissions:",{"$nulls":17},"Unselected"]
[null,null,"Bonus:","",null,"(1) Net Earnings:","",{"$nulls":3},{"$f":"IF(OR(N4=AB55),\"Converted Income:  \",IF(OR(N4=AB56),\"Converted Income:  \",IF(OR(N4=AB57),\"Converted Income:  \",IF(OR(N4=AB58),\"Average Monthly Income:\",\"<<Select Frequency of Pay Above>>\"))))","v":"<<Select Frequency of Pay Above>>"},null,null,{"$f":"IF(ISERROR(O6),\"\",(O6))","v":{"v":0,"d":"$0.00"}},{"$f":"IF(OR(N4=AB55),AF63,IF(OR(N4=AB56),AF64,IF(OR(N4=AB57),AF65,IF(OR(N4=AB58),AF66,0))))","v":0},{"$nulls":4}," ",null,null,"Bonus:"]
[null,null,"Other:","",null,"(2) Period End Date:","",{"$nulls":4},"Participant Name:  ",{"$nulls":10},"Other:",{"$nulls":17},"Weekly"]
[null,null,"Total:","",null,"(2) Pay Date:","",{"$nulls":4},"Employer Name:  ",{"$nulls":10},"Total:",{"$nulls":17},"Every Other Week"]
[{"$nulls":5},"(2) Hours Worked:","",{"$nulls":12}," ",{"$nulls":11},"checks","excluded","remaining",{"$nulls":6},"Twice Per Month"]
[{"$nulls":5},"(2) Gross Earnings:","",{"$nulls":16},"Paste Paydate Info Below (Yellow):",{"$nulls":16},"Monthly"]
[{"$nulls":5},"(2) Net Earnings:","",null,null,"Year","Base Salary:","Overtime:","Commissions:","Bonus:","Other:","Total:",null,{"$f":"IF(S13<>\"\",\"copy here >>\",\"\")","v":""},{"$f":"IF(N36=0,\"\",AD46)","v":""}," "]
[{"$nulls":5},"(3) Period End Date:","",null,"Income Summary:",{"$f":"IF($D$4=\"\",\"\",$D$4)","v":""},{"$f":"IF($D$5=\"\",\"\",$D$5)","v":""},{"$f":"IF($D$6=\"\",\"\",$D$6)","v":""},{"$f":"IF($D$7=\"\",\"\",$D$7)","v":""},{"$f":"IF($D$8=\"\",\"\",$D$8)","v":""},{"$f":"IF($D$9=\"\",\"\",$D$9)","v":""},{"$f":"IF($D$10=\"\",\"\",$D$10)","v":""},null,{"$f":"IF(S13<>\"\",\"copy here >>\",\"\")","v":""},null," "]
[{"$nulls":5},"(3) Pay Date:","",{"$nulls":10},{"$f":"IF(S13<>\"\",\"copy here >>\",\"\")","v":""},{"$f":"IF(N36=0,\"\",AD2)","v":""}," ",null,null,"(1) Period End Date:",{"$nulls":6},{"$f":"IF(calculations!L10=FALSE,M17,0)","v":""},{"$f":"IF(calculations!L10=FALSE,N17,0)","v":""},{"$f":"19-COUNTBLANK(N17:N35)","v":0},{"$f":"COUNTIF(calculations!L10:L28,TRUE)","v":0},{"$f":"AF15-AG15+AG17","v":0}]
{"$rows_left_out":117}
{"sheet":"calculations","index":4,"n_rows":53,"n_cols":16,"rows_kept":53,"hidden":true}
{"$rows_empty":8}
[{"$nulls":14},"example pay"]
[{"$nulls":3},"pay period end date","pay date","hours worked","income","Net pay",null,null,false,false,null,null,"2014-01-01",{"v":408.11,"d":"$408.11"}]
[{"$nulls":3},"2012-02-03","2012-02-10",80,{"v":956.9,"d":"$956.90"},{"v":860.32,"d":"$860.32"},null,null,false,false,null,null,"2014-01-08",{"v":413.85,"d":"$413.85"}]
[{"$nulls":3},"2012-01-20","2012-01-27",73.45,{"v":713.29,"d":"$713.29"},{"v":664.99,"d":"$664.99"},null,null,false,false,null,null,"2014-01-15",{"v":900,"d":"$900.00"}]
[{"$nulls":10},false,false,null,null,"2014-01-22",{"v":419.22,"d":"$419.22"}]
[{"$nulls":3},"Pay Period End Date","Pay Date","Hours Worked","Gross Earnings","Net",null,null,false,false,null,null,"2014-01-29",{"v":401.25,"d":"$401.25"}]
[{"$nulls":3},"2014-07-12","2014-07-17",40,{"v":640,"d":"$640.00"},{"v":498.36,"d":"$498.36"},null,null,false,false,null,null,"2014-02-05",{"v":406.72,"d":"$406.72"}]
[{"$nulls":3},"2014-07-05","2014-07-10",22.5,{"v":360,"d":"$360.00"},{"v":255.46,"d":"$255.46"},null,null,false,false,null,null,"2014-02-12",{"v":405.22,"d":"$405.22"}]
[{"$nulls":3},"2014-06-28","2014-07-03",40,{"v":640,"d":"$640.00"},{"v":498.36,"d":"$498.36"},null,null,false,false,null,null,"2014-02-19",{"v":751,"d":"$751.00"}]
[{"$nulls":3},"2014-06-21","2014-06-26",32,{"v":512,"d":"$512.00"},{"v":391.68,"d":"$391.68"},null,null,false,false,null,null,"2014-02-26",{"v":403.22,"d":"$403.22"}]
[{"$nulls":3},"2014-06-14","2014-06-19",40,{"v":640,"d":"$640.00"},{"v":498.36,"d":"$498.36"},null,null,false,false,null,null,"2014-03-05",{"v":401.11,"d":"$401.11"}]
[{"$nulls":3},"2014-06-07","2014-06-12",40,{"v":640,"d":"$640.00"},{"v":498.36,"d":"$498.36"},null,null,false,false,null,null,"2014-03-12",{"v":417.22,"d":"$417.22"}]
[{"$nulls":3},"2014-05-31","2014-06-05",32,{"v":512,"d":"$512.00"},{"v":391.66,"d":"$391.66"},null,null,false,false,null,null,"2014-03-19",{"v":427.63,"d":"$427.63"}]
[{"$nulls":3},"2014-05-24","2014-05-29",40,{"v":640,"d":"$640.00"},{"v":498.36,"d":"$498.36"},null,null,false,false,null,null,"2014-03-26",{"v":395.22,"d":"$395.22"}]
{"$rows_left_out":32}
{"sheet":"Self-Employment","index":5,"n_rows":67,"n_cols":28,"rows_kept":67,"merged":[[1,1,1,18],[3,14,6,16]]}
[]
[null,"Self-Employment Calculator"]
[]
[null,null,"Sampling Type:",null,"Expenses:",null,"Number of Months Sampled:",{"$nulls":3},"Applicable Oregon Min Wage:",{"$nulls":3},{"$f":"IF(ISERROR(Q9),\"\",(Q9))","v":""}]
[null,null,"unselected",{"$nulls":17},1]
[{"$nulls":20},2]
[{"$nulls":20},3]
[null,null,"Start Month:",{"$nulls":17},4]
[null,null,"2018-01-01",1,2,3,4,5,6,7,8,9,10,11,12,{"$f":"IF(G$5>0,\"copy line >>\",\"\")","v":""},{"$f":"IF(ISERROR(B47),\"\",(B47))","v":""}," ",null,null,5]
[{"$nulls":3},{"$f":"DATE(YEAR(C9),MONTH(C9),DAY(C9))","v":"2018-01-01"},{"$f":"DATE(YEAR(D10),MONTH(D10)+1,DAY(55))","v":"2018-02-24"},{"$f":"DATE(YEAR(E10),MONTH(E10)+1,DAY(55))","v":"2018-03-24"},"2018-04-24","2018-05-24","2018-06-24","2018-07-24","2018-08-24","2018-09-24","2018-10-24","2018-11-24","2018-12-24",{"$f":"IF(G$5>0,\"copy line >>\",\"\")","v":""},{"$nulls":4},6]
[{"$nulls":15},{"$f":"IF(G$5>0,\"copy line >>\",\"\")","v":""},{"$f":"B49","v":""},{"$nulls":3},7]
[{"$nulls":15},{"$f":"IF(G$5>0,\"copy line >>\",\"\")","v":""},{"$f":"IFERROR(IF($G$5=1,\"Coded Income: \"&TEXT($V$34,\"######.00\")&\" - Avg. Hrs/Wk for JPI/Stu: \"&TEXT($W$30,\"####.00\")&\" - Avg Hrs/Wk for ABAWD: \"&TEXT($V$47,\"####.00\"),B50),\"Please Enter Applicable Oregon Minimum Wage\")","v":""},{"$nulls":3},8]
[{"$nulls":15},{"$f":"IF(G$5>1,\"copy line >>\",\"\")","v":""},{"$f":"IFERROR(IF($G$5=2,\"Coded Income: \"&TEXT($V$34,\"######.00\")&\" - Avg. Hrs/Wk for JPI/Stu: \"&TEXT($W$30,\"####.00\")&\" - Avg Hrs/Wk for ABAWD: \"&TEXT($V$47,\"####.00\"),B51),\"Please Enter Applicable Oregon Minimum Wage\")","v":""},{"$nulls":3},9]
[{"$nulls":15},{"$f":"IF(G$5>2,\"copy line >>\",\"\")","v":""},{"$f":"IFERROR(IF($G$5=3,\"Coded Income: \"&TEXT($V$34,\"######.00\")&\" - Avg. Hrs/Wk for JPI/Stu: \"&TEXT($W$30,\"####.00\")&\" - Avg Hrs/Wk for ABAWD: \"&TEXT($V$47,\"####.00\"),B52),\"Please Enter Applicable Oregon Minimum Wage\")","v":""},{"$nulls":3},10]
[{"$nulls":15},{"$f":"IF(G$5>3,\"copy line >>\",\"\")","v":""},{"$f":"IFERROR(IF($G$5=4,\"Coded Income: \"&TEXT($V$34,\"######.00\")&\" - Avg. Hrs/Wk for JPI/Stu: \"&TEXT($W$30,\"####.00\")&\" - Avg Hrs/Wk for ABAWD: \"&TEXT($V$47,\"####.00\"),B53),\"Please Enter Applicable Oregon Minimum Wage\")","v":""},{"$nulls":3},11]
{"$rows_left_out":53}
{"sheet":"Missing Check","index":6,"n_rows":51,"n_cols":11,"rows_kept":51,"merged":[[1,1,1,9],[12,4,16,7],[17,5,17,6]]}
[]
[null,"Missing Check Calculator"]
[]
[{"$nulls":5},"Date","Gross Amount","YTD"]
[{"$nulls":4},"1st Check:"]
[{"$nulls":4},"2nd Check:"]
[{"$nulls":4},"Days Between:",{"$f":"IF(F6=0,\"\",F6-F5)","v":""},{"$f":"IFERROR(F7/2,\"\")","v":""}]
[]
[{"$nulls":4},"Missing Check:",{"$f":"IFERROR(F5+G7,\"\")","v":""},{"$f":"H9-H5","v":{"v":0,"d":"0.00"}},{"$f":"H6-G6","v":{"v":0,"d":"0.00"}}]
[]
[]
[]
[{"$nulls":4},{"$f":"IF(H6>0,D41,\"\")","v":""}]
[]
[]
{"$rows_left_out":21}
{"sheet":"Missing Check Old","index":7,"n_rows":49,"n_cols":11,"rows_kept":49,"hidden":true,"merged":[[1,1,1,9],[7,3,7,4],[10,4,15,7]]}
[]
[null,"Missing Check Calculator"]
[]
[{"$nulls":3},"1st Check Date:",null,"1st Check Amount:",null,"1st Check YTD:"]
[null,null,{"$f":"IF(E6=0,\"\",E6-E4)","v":""},"Days Between",{"$f":"IFERROR(C5/2,\"\")","v":""},"Missing Check Amount:",{"$f":"I5-I4","v":{"v":0,"d":"0.00"}},"Missing Check YTD:",{"$f":"I6-G6","v":{"v":0,"d":"0.00"}}]
[{"$nulls":3},"2nd Check Date:",null,"2nd Check Amount:",null,"2nd Check YTD:"]
[]
[null,null," ","Likely Missing Check Date: ",null,{"$f":"IFERROR(E4+E5,\"\")","v":""}]
[]
[]
[{"$nulls":4},{"$f":"IF(I6>0,D39,\"\")","v":""}]
[]
[]
[]
[]
{"$rows_left_out":19}
{"sheet":"Pay Rate Conversion","index":8,"n_rows":23,"n_cols":9,"rows_kept":23,"merged":[[1,1,1,6],[6,2,6,4],[7,2,7,4],[10,2,17,5],[18,2,18,3],[22,7,23,10]]}
[]
[null,"Pay Rate Conversion Calculator"]
[]
[null,null,"Old Rate:",null,null,"New Rate:"]
[null,null,{"v":11.25,"d":"$11.25"}]
[{"$nulls":8},{"v":11,"d":"$11.00"}]
[null,null,"Old Rate Earnings:",{"$nulls":4},{"$f":"F5/C5","v":{"v":0,"d":"0.0000"}},{"v":11.25,"d":"$11.25"}]
[null,null,"Adjusted New Rate Earnings:",null,null,{"$f":"F7*H7","v":{"v":0,"d":"$0.00"}},null,null,{"v":12.5,"d":"$12.50"}]
[]
[]
[null,null,{"$f":"IF(F7>0,H23,\"\")","v":""}]
{"$rows_empty":7}
[null,null,{"$f":"IF(F7>0,\"COPY HERE >>>>\",\"\")","v":""},null,{"$f":"C11","v":""}," "]
[]
[]
{"$rows_left_out":3}
{"sheet":"Day Care","index":9,"n_rows":207,"n_cols":30,"rows_kept":207,"merged":[[1,1,1,10],[3,3,3,4],[3,7,3,8],[19,2,19,6],[20,2,20,6],[21,2,21,6],[22,2,22,6],[23,2,23,6],[24,2,24,6],[25,2,25,6],[26,2,26,6],[27,2,27,6],[28,2,28,6],[32,9,32,11],[78,1,79,4]]}
[]
[null,"Day Care Hour Calculator"]
[]
[{"$nulls":3},"                        Name of Parent One:",{"$nulls":3},"           Name of Parent Two:"]
[]
[null,null,"Both parents work this day?:",null,"Start:","Stop:",null,"Start:","Stop:","Day Care Needed:"]
[null,null,"no","Monday",{"$nulls":5},{"$f":"IF(C7=\"yes\",AD120,0)","v":{"v":0,"d":"0.00"}}]
[null,null,"no","Tuesday",{"$nulls":5},{"v":0,"d":"0.00"}]
[null,null,"no","Wednesday",{"$nulls":5},{"v":0,"d":"0.00"}]
[null,null,"no","Thursday",{"$nulls":5},{"v":0,"d":"0.00"}]
[null,null,"no","Friday",{"$nulls":5},{"v":0,"d":"0.00"}]
[null,null,"no","Saturday",{"$nulls":5},{"v":0,"d":"0.00"}]
[null,null,"no","Sunday",{"$nulls":5},{"v":0,"d":"0.00"}]
[]
[{"$nulls":8},"weekly total:",{"$f":"SUM(W91:W97)","v":{"v":0,"d":"0.00"}}]
{"$rows_left_out":155}